{"text_format":"1","workbook":"xlsx","n_sheets":5,"sheets":["model","dropdown","estrato","salud","recoding"],"not_rendered":{"charts":2,"images":0,"macros":1,"external_links":0,"defined_names":30,"comments":0,"pivot_tables":0},"unopened":[],"bounds":{"document_bytes":16777216,"sheet_cells":100000,"rows_first":2000,"rows_last":500,"rows_between":2000,"halvings":0,"cell_chars":16384,"cell_head_chars":4096},"cells_cut":0,"cells_raw":0,"read":"whole","date_system":"1900"}

{"sheet":"model","index":0,"n_rows":219,"n_cols":35,"rows_kept":219,"cut":false,"hidden":false,"merged":[[200,1,200,4],[197,1,198,1],[197,4,198,4],[112,15,112,16],[112,19,112,21],[184,2,184,3],[197,2,197,3],[199,1,199,4],[112,1,112,4],[112,5,112,8],[112,22,112,24],[112,25,112,27],[112,28,112,30],[112,9,112,10],[112,11,112,12],[112,13,112,14],[49,9,49,12],[5,2,5,3],[11,2,11,4],[11,5,11,7],[89,2,89,3],[89,4,89,5],[49,2,49,5],[10,2,10,4],[10,5,10,7]]}
[]
["ONS - Herramienta para el análsisi de desigualdades en Salud"]
[]
["1. Parámetros"]
[]
[null,"Indicador salud","Mortalidad Materna",null,{"$f":"VLOOKUP(CONCATENATE(B15,$F$12,indicador_sel),salud!A:H,8,0)","v":100000}]
[null,"Indicador económico","PIB"]
[null,"Sentido",{"$f":"VLOOKUP(estrato_sel,direction,2,0)","v":"Positivo"}]
[null,null,null,null,null,null,null,null,false]
[null,"Tabla datos"]
[null,null,{"$f":"VLOOKUP(event_sel,periods,2,0)","v":"2000-2005"},null,null,{"$f":"VLOOKUP(event_sel,periods,3,0)","v":"2010-2015"}]
[null,null,"p1",null,null,"p2"]
[null,null,"se","casos","pob","se","casos","pob"]
[null,"Amazonas",{"$f":"VLOOKUP(CONCATENATE(B14,$C$12,estrato_sel),estrato!A:F,6,0)","v":231.83333333333334},{"$f":"IFERROR(VLOOKUP(CONCATENATE(B14,$C$12,indicador_sel),salud!A:H,6,0),0)","v":12},{"$f":"VLOOKUP(CONCATENATE(B14,$C$12,indicador_sel),salud!A:H,7,0)","v":8100},{"$f":"VLOOKUP(CONCATENATE(B14,$F$12,estrato_sel),estrato!A:F,6,0)","v":326.5},{"$f":"IFERROR(VLOOKUP(CONCATENATE(B14,$F$12,indicador_sel),salud!A:H,6,0),0)","v":7},{"$f":"VLOOKUP(CONCATENATE(B14,$F$12,indicador_sel),salud!A:H,7,0)","v":8618},{"$f":"B14","v":"Amazonas"}]
[null,"Antioquia",{"$f":"VLOOKUP(CONCATENATE(B15,$C$12,estrato_sel),estrato!A:F,6,0)","v":41657.333333333336},{"$f":"IFERROR(VLOOKUP(CONCATENATE(B15,$C$12,indicador_sel),salud!A:H,6,0),0)","v":373},{"$f":"VLOOKUP(CONCATENATE(B15,$C$12,indicador_sel),salud!A:H,7,0)","v":579644},{"$f":"VLOOKUP(CONCATENATE(B15,$F$12,estrato_sel),estrato!A:F,6,0)","v":65591},{"$f":"IFERROR(VLOOKUP(CONCATENATE(B15,$F$12,indicador_sel),salud!A:H,6,0),0)","v":211},{"$f":"VLOOKUP(CONCATENATE(B15,$F$12,indicador_sel),salud!A:H,7,0)","v":458869},{"$f":"B15","v":"Antioquia"}]
[null,"Arauca",{"$f":"VLOOKUP(CONCATENATE(B16,$C$12,estrato_sel),estrato!A:F,6,0)","v":3005.3333333333335},{"$f":"IFERROR(VLOOKUP(CONCATENATE(B16,$C$12,indicador_sel),salud!A:H,6,0),0)","v":30},{"$f":"VLOOKUP(CONCATENATE(B16,$C$12,indicador_sel),salud!A:H,7,0)","v":31182},{"$f":"VLOOKUP(CONCATENATE(B16,$F$12,estrato_sel),estrato!A:F,6,0)","v":3147},{"$f":"IFERROR(VLOOKUP(CONCATENATE(B16,$F$12,indicador_sel),salud!A:H,6,0),0)","v":14},{"$f":"VLOOKUP(CONCATENATE(B16,$F$12,indicador_sel),salud!A:H,7,0)","v":25633},"Arauca"]
[null,"Atlántico",{"$f":"VLOOKUP(CONCATENATE(B17,$C$12,estrato_sel),estrato!A:F,6,0)","v":12464.166666666666},{"$f":"IFERROR(VLOOKUP(CONCATENATE(B17,$C$12,indicador_sel),salud!A:H,6,0),0)","v":189},{"$f":"VLOOKUP(CONCATENATE(B17,$C$12,indicador_sel),salud!A:H,7,0)","v":247615},{"$f":"VLOOKUP(CONCATENATE(B17,$F$12,estrato_sel),estrato!A:F,6,0)","v":19295.166666666668},{"$f":"IFERROR(VLOOKUP(CONCATENATE(B17,$F$12,indicador_sel),salud!A:H,6,0),0)","v":139},{"$f":"VLOOKUP(CONCATENATE(B17,$F$12,indicador_sel),salud!A:H,7,0)","v":230819},"Atlántico"]
[null,"Bogotá",{"$f":"VLOOKUP(CONCATENATE(B18,$C$12,estrato_sel),estrato!A:F,6,0)","v":80237.833333333328},{"$f":"IFERROR(VLOOKUP(CONCATENATE(B18,$C$12,indicador_sel),salud!A:H,6,0),0)","v":483},{"$f":"VLOOKUP(CONCATENATE(B18,$C$12,indicador_sel),salud!A:H,7,0)","v":697517},{"$f":"VLOOKUP(CONCATENATE(B18,$F$12,estrato_sel),estrato!A:F,6,0)","v":125643},{"$f":"IFERROR(VLOOKUP(CONCATENATE(B18,$F$12,indicador_sel),salud!A:H,6,0),0)","v":227},{"$f":"VLOOKUP(CONCATENATE(B18,$F$12,indicador_sel),salud!A:H,7,0)","v":633311},"Bogotá"]
[null,"Bolívar",{"$f":"VLOOKUP(CONCATENATE(B19,$C$12,estrato_sel),estrato!A:F,6,0)","v":11807.666666666666},{"$f":"IFERROR(VLOOKUP(CONCATENATE(B19,$C$12,indicador_sel),salud!A:H,6,0),0)","v":158},{"$f":"VLOOKUP(CONCATENATE(B19,$C$12,indicador_sel),salud!A:H,7,0)","v":185444},{"$f":"VLOOKUP(CONCATENATE(B19,$F$12,estrato_sel),estrato!A:F,6,0)","v":18524.833333333332},{"$f":"IFERROR(VLOOKUP(CONCATENATE(B19,$F$12,indicador_sel),salud!A:H,6,0),0)","v":122},{"$f":"VLOOKUP(CONCATENATE(B19,$F$12,indicador_sel),salud!A:H,7,0)","v":210859},"Bolívar"]
[null,"Boyacá",{"$f":"VLOOKUP(CONCATENATE(B20,$C$12,estrato_sel),estrato!A:F,6,0)","v":8249.8333333333339},{"$f":"IFERROR(VLOOKUP(CONCATENATE(B20,$C$12,indicador_sel),salud!A:H,6,0),0)","v":114},{"$f":"VLOOKUP(CONCATENATE(B20,$C$12,indicador_sel),salud!A:H,7,0)","v":129450},{"$f":"VLOOKUP(CONCATENATE(B20,$F$12,estrato_sel),estrato!A:F,6,0)","v":13203.166666666666},{"$f":"IFERROR(VLOOKUP(CONCATENATE(B20,$F$12,indicador_sel),salud!A:H,6,0),0)","v":51},{"$f":"VLOOKUP(CONCATENATE(B20,$F$12,indicador_sel),salud!A:H,7,0)","v":99677},"Boyacá"]
[null,"Caldas",{"$f":"VLOOKUP(CONCATENATE(B21,$C$12,estrato_sel),estrato!A:F,6,0)","v":5405.166666666667},{"$f":"IFERROR(VLOOKUP(CONCATENATE(B21,$C$12,indicador_sel),salud!A:H,6,0),0)","v":80},{"$f":"VLOOKUP(CONCATENATE(B21,$C$12,indicador_sel),salud!A:H,7,0)","v":91186},{"$f":"VLOOKUP(CONCATENATE(B21,$F$12,estrato_sel),estrato!A:F,6,0)","v":7139.5},{"$f":"IFERROR(VLOOKUP(CONCATENATE(B21,$F$12,indicador_sel),salud!A:H,6,0),0)","v":33},{"$f":"VLOOKUP(CONCATENATE(B21,$F$12,indicador_sel),salud!A:H,7,0)","v":62084},"Caldas"]
[null,"Caquetá",{"$f":"VLOOKUP(CONCATENATE(B22,$C$12,estrato_sel),estrato!A:F,6,0)","v":1433.5},{"$f":"IFERROR(VLOOKUP(CONCATENATE(B22,$C$12,indicador_sel),salud!A:H,6,0),0)","v":73},{"$f":"VLOOKUP(CONCATENATE(B22,$C$12,indicador_sel),salud!A:H,7,0)","v":41197},{"$f":"VLOOKUP(CONCATENATE(B22,$F$12,estrato_sel),estrato!A:F,6,0)","v":2136.6666666666665},{"$f":"IFERROR(VLOOKUP(CONCATENATE(B22,$F$12,indicador_sel),salud!A:H,6,0),0)","v":53},{"$f":"VLOOKUP(CONCATENATE(B22,$F$12,indicador_sel),salud!A:H,7,0)","v":45108},"Caquetá"]
[null,"Casanare",{"$f":"VLOOKUP(CONCATENATE(B23,$C$12,estrato_sel),estrato!A:F,6,0)","v":8879},{"$f":"IFERROR(VLOOKUP(CONCATENATE(B23,$C$12,indicador_sel),salud!A:H,6,0),0)","v":16},{"$f":"VLOOKUP(CONCATENATE(B23,$C$12,indicador_sel),salud!A:H,7,0)","v":34515},{"$f":"VLOOKUP(CONCATENATE(B23,$F$12,estrato_sel),estrato!A:F,6,0)","v":8208.6666666666661},{"$f":"IFERROR(VLOOKUP(CONCATENATE(B23,$F$12,indicador_sel),salud!A:H,6,0),0)","v":19},{"$f":"VLOOKUP(CONCATENATE(B23,$F$12,indicador_sel),salud!A:H,7,0)","v":41269},"Casanare"]
[null,"Cauca",{"$f":"VLOOKUP(CONCATENATE(B24,$C$12,estrato_sel),estrato!A:F,6,0)","v":4352.166666666667},{"$f":"IFERROR(VLOOKUP(CONCATENATE(B24,$C$12,indicador_sel),salud!A:H,6,0),0)","v":162},{"$f":"VLOOKUP(CONCATENATE(B24,$C$12,indicador_sel),salud!A:H,7,0)","v":107200},{"$f":"VLOOKUP(CONCATENATE(B24,$F$12,estrato_sel),estrato!A:F,6,0)","v":7476.5},{"$f":"IFERROR(VLOOKUP(CONCATENATE(B24,$F$12,indicador_sel),salud!A:H,6,0),0)","v":113},{"$f":"VLOOKUP(CONCATENATE(B24,$F$12,indicador_sel),salud!A:H,7,0)","v":106211},"Cauca"]
[null,"Cesar",{"$f":"VLOOKUP(CONCATENATE(B25,$C$12,estrato_sel),estrato!A:F,6,0)","v":5192.833333333333},{"$f":"IFERROR(VLOOKUP(CONCATENATE(B25,$C$12,indicador_sel),salud!A:H,6,0),0)","v":89},{"$f":"VLOOKUP(CONCATENATE(B25,$C$12,indicador_sel),salud!A:H,7,0)","v":115867},{"$f":"VLOOKUP(CONCATENATE(B25,$F$12,estrato_sel),estrato!A:F,6,0)","v":9299.1666666666661},{"$f":"IFERROR(VLOOKUP(CONCATENATE(B25,$F$12,indicador_sel),salud!A:H,6,0),0)","v":102},{"$f":"VLOOKUP(CONCATENATE(B25,$F$12,indicador_sel),salud!A:H,7,0)","v":123632},"Cesar"]
[null,"Chocó",{"$f":"VLOOKUP(CONCATENATE(B26,$C$12,estrato_sel),estrato!A:F,6,0)","v":1084.1666666666667},{"$f":"IFERROR(VLOOKUP(CONCATENATE(B26,$C$12,indicador_sel),salud!A:H,6,0),0)","v":95},{"$f":"VLOOKUP(CONCATENATE(B26,$C$12,indicador_sel),salud!A:H,7,0)","v":28046},{"$f":"VLOOKUP(CONCATENATE(B26,$F$12,estrato_sel),estrato!A:F,6,0)","v":1884.5},{"$f":"IFERROR(VLOOKUP(CONCATENATE(B26,$F$12,indicador_sel),salud!A:H,6,0),0)","v":78},{"$f":"VLOOKUP(CONCATENATE(B26,$F$12,indicador_sel),salud!A:H,7,0)","v":38543},"Chocó"]
[null,"Córdoba",{"$f":"VLOOKUP(CONCATENATE(B27,$C$12,estrato_sel),estrato!A:F,6,0)","v":6297.666666666667},{"$f":"IFERROR(VLOOKUP(CONCATENATE(B27,$C$12,indicador_sel),salud!A:H,6,0),0)","v":146},{"$f":"VLOOKUP(CONCATENATE(B27,$C$12,indicador_sel),salud!A:H,7,0)","v":146885},{"$f":"VLOOKUP(CONCATENATE(B27,$F$12,estrato_sel),estrato!A:F,6,0)","v":8567.5},{"$f":"IFERROR(VLOOKUP(CONCATENATE(B27,$F$12,indicador_sel),salud!A:H,6,0),0)","v":161},{"$f":"VLOOKUP(CONCATENATE(B27,$F$12,indicador_sel),salud!A:H,7,0)","v":159118},"Córdoba"]
[null,"Cundinamarca",{"$f":"VLOOKUP(CONCATENATE(B28,$C$12,estrato_sel),estrato!A:F,6,0)","v":15998.666666666666},{"$f":"IFERROR(VLOOKUP(CONCATENATE(B28,$C$12,indicador_sel),salud!A:H,6,0),0)","v":167},{"$f":"VLOOKUP(CONCATENATE(B28,$C$12,indicador_sel),salud!A:H,7,0)","v":213177},{"$f":"VLOOKUP(CONCATENATE(B28,$F$12,estrato_sel),estrato!A:F,6,0)","v":25684.5},{"$f":"IFERROR(VLOOKUP(CONCATENATE(B28,$F$12,indicador_sel),salud!A:H,6,0),0)","v":103},{"$f":"VLOOKUP(CONCATENATE(B28,$F$12,indicador_sel),salud!A:H,7,0)","v":207543},"Cundinamarca"]
[null,"Guainía",{"$f":"VLOOKUP(CONCATENATE(B29,$C$12,estrato_sel),estrato!A:F,6,0)","v":105.66666666666667},{"$f":"IFERROR(VLOOKUP(CONCATENATE(B29,$C$12,indicador_sel),salud!A:H,6,0),0)","v":8},{"$f":"VLOOKUP(CONCATENATE(B29,$C$12,indicador_sel),salud!A:H,7,0)","v":3252},{"$f":"VLOOKUP(CONCATENATE(B29,$F$12,estrato_sel),estrato!A:F,6,0)","v":150},{"$f":"IFERROR(VLOOKUP(CONCATENATE(B29,$F$12,indicador_sel),salud!A:H,6,0),0)","v":6},{"$f":"VLOOKUP(CONCATENATE(B29,$F$12,indicador_sel),salud!A:H,7,0)","v":3520},"Guainía"]
[null,"Guaviare",{"$f":"VLOOKUP(CONCATENATE(B30,$C$12,estrato_sel),estrato!A:F,6,0)","v":314},{"$f":"IFERROR(VLOOKUP(CONCATENATE(B30,$C$12,indicador_sel),salud!A:H,6,0),0)","v":22},{"$f":"VLOOKUP(CONCATENATE(B30,$C$12,indicador_sel),salud!A:H,7,0)","v":9674},{"$f":"VLOOKUP(CONCATENATE(B30,$F$12,estrato_sel),estrato!A:F,6,0)","v":363.66666666666669},{"$f":"IFERROR(VLOOKUP(CONCATENATE(B30,$F$12,indicador_sel),salud!A:H,6,0),0)","v":7},{"$f":"VLOOKUP(CONCATENATE(B30,$F$12,indicador_sel),salud!A:H,7,0)","v":7240},"Guaviare"]
[null,"Huila",{"$f":"VLOOKUP(CONCATENATE(B31,$C$12,estrato_sel),estrato!A:F,6,0)","v":5937.333333333333},{"$f":"IFERROR(VLOOKUP(CONCATENATE(B31,$C$12,indicador_sel),salud!A:H,6,0),0)","v":93},{"$f":"VLOOKUP(CONCATENATE(B31,$C$12,indicador_sel),salud!A:H,7,0)","v":129970},{"$f":"VLOOKUP(CONCATENATE(B31,$F$12,estrato_sel),estrato!A:F,6,0)","v":8176.166666666667},{"$f":"IFERROR(VLOOKUP(CONCATENATE(B31,$F$12,indicador_sel),salud!A:H,6,0),0)","v":42},{"$f":"VLOOKUP(CONCATENATE(B31,$F$12,indicador_sel),salud!A:H,7,0)","v":120104},"Huila"]
[null,"La Guajira",{"$f":"VLOOKUP(CONCATENATE(B32,$C$12,estrato_sel),estrato!A:F,6,0)","v":3492.5},{"$f":"IFERROR(VLOOKUP(CONCATENATE(B32,$C$12,indicador_sel),salud!A:H,6,0),0)","v":73},{"$f":"VLOOKUP(CONCATENATE(B32,$C$12,indicador_sel),salud!A:H,7,0)","v":62074},{"$f":"VLOOKUP(CONCATENATE(B32,$F$12,estrato_sel),estrato!A:F,6,0)","v":5415.166666666667},{"$f":"IFERROR(VLOOKUP(CONCATENATE(B32,$F$12,indicador_sel),salud!A:H,6,0),0)","v":136},{"$f":"VLOOKUP(CONCATENATE(B32,$F$12,indicador_sel),salud!A:H,7,0)","v":81311},"La Guajira"]
[null,"Magdalena",{"$f":"VLOOKUP(CONCATENATE(B33,$C$12,estrato_sel),estrato!A:F,6,0)","v":4077.1666666666665},{"$f":"IFERROR(VLOOKUP(CONCATENATE(B33,$C$12,indicador_sel),salud!A:H,6,0),0)","v":134},{"$f":"VLOOKUP(CONCATENATE(B33,$C$12,indicador_sel),salud!A:H,7,0)","v":117816},{"$f":"VLOOKUP(CONCATENATE(B33,$F$12,estrato_sel),estrato!A:F,6,0)","v":6318.666666666667},{"$f":"IFERROR(VLOOKUP(CONCATENATE(B33,$F$12,indicador_sel),salud!A:H,6,0),0)","v":113},{"$f":"VLOOKUP(CONCATENATE(B33,$F$12,indicador_sel),salud!A:H,7,0)","v":135486},"Magdalena"]
[null,"Meta",{"$f":"VLOOKUP(CONCATENATE(B34,$C$12,estrato_sel),estrato!A:F,6,0)","v":6387.333333333333},{"$f":"IFERROR(VLOOKUP(CONCATENATE(B34,$C$12,indicador_sel),salud!A:H,6,0),0)","v":89},{"$f":"VLOOKUP(CONCATENATE(B34,$C$12,indicador_sel),salud!A:H,7,0)","v":90908},{"$f":"VLOOKUP(CONCATENATE(B34,$F$12,estrato_sel),estrato!A:F,6,0)","v":20922.666666666668},{"$f":"IFERROR(VLOOKUP(CONCATENATE(B34,$F$12,indicador_sel),salud!A:H,6,0),0)","v":45},{"$f":"VLOOKUP(CONCATENATE(B34,$F$12,indicador_sel),salud!A:H,7,0)","v":92887},"Meta"]
[null,"Nariño",{"$f":"VLOOKUP(CONCATENATE(B35,$C$12,estrato_sel),estrato!A:F,6,0)","v":4710.166666666667},{"$f":"IFERROR(VLOOKUP(CONCATENATE(B35,$C$12,indicador_sel),salud!A:H,6,0),0)","v":170},{"$f":"VLOOKUP(CONCATENATE(B35,$C$12,indicador_sel),salud!A:H,7,0)","v":129536},{"$f":"VLOOKUP(CONCATENATE(B35,$F$12,estrato_sel),estrato!A:F,6,0)","v":7221.166666666667},{"$f":"IFERROR(VLOOKUP(CONCATENATE(B35,$F$12,indicador_sel),salud!A:H,6,0),0)","v":86},{"$f":"VLOOKUP(CONCATENATE(B35,$F$12,indicador_sel),salud!A:H,7,0)","v":108734},"Nariño"]
[null,"Norte de Santander",{"$f":"VLOOKUP(CONCATENATE(B36,$C$12,estrato_sel),estrato!A:F,6,0)","v":5259},{"$f":"IFERROR(VLOOKUP(CONCATENATE(B36,$C$12,indicador_sel),salud!A:H,6,0),0)","v":94},{"$f":"VLOOKUP(CONCATENATE(B36,$C$12,indicador_sel),salud!A:H,7,0)","v":133690},{"$f":"VLOOKUP(CONCATENATE(B36,$F$12,estrato_sel),estrato!A:F,6,0)","v":7821.5},{"$f":"IFERROR(VLOOKUP(CONCATENATE(B36,$F$12,indicador_sel),salud!A:H,6,0),0)","v":74},{"$f":"VLOOKUP(CONCATENATE(B36,$F$12,indicador_sel),salud!A:H,7,0)","v":123434},"Norte de Santander"]
[null,"Putumayo",{"$f":"VLOOKUP(CONCATENATE(B37,$C$12,estrato_sel),estrato!A:F,6,0)","v":1018.3333333333334},{"$f":"IFERROR(VLOOKUP(CONCATENATE(B37,$C$12,indicador_sel),salud!A:H,6,0),0)","v":38},{"$f":"VLOOKUP(CONCATENATE(B37,$C$12,indicador_sel),salud!A:H,7,0)","v":29600},{"$f":"VLOOKUP(CONCATENATE(B37,$F$12,estrato_sel),estrato!A:F,6,0)","v":2236},{"$f":"IFERROR(VLOOKUP(CONCATENATE(B37,$F$12,indicador_sel),salud!A:H,6,0),0)","v":36},{"$f":"VLOOKUP(CONCATENATE(B37,$F$12,indicador_sel),salud!A:H,7,0)","v":25939},"Putumayo"]
[null,"Quindío",{"$f":"VLOOKUP(CONCATENATE(B38,$C$12,estrato_sel),estrato!A:F,6,0)","v":2763.3333333333335},{"$f":"IFERROR(VLOOKUP(CONCATENATE(B38,$C$12,indicador_sel),salud!A:H,6,0),0)","v":32},{"$f":"VLOOKUP(CONCATENATE(B38,$C$12,indicador_sel),salud!A:H,7,0)","v":51833},{"$f":"VLOOKUP(CONCATENATE(B38,$F$12,estrato_sel),estrato!A:F,6,0)","v":3607.6666666666665},{"$f":"IFERROR(VLOOKUP(CONCATENATE(B38,$F$12,indicador_sel),salud!A:H,6,0),0)","v":15},{"$f":"VLOOKUP(CONCATENATE(B38,$F$12,indicador_sel),salud!A:H,7,0)","v":35934},"Quindío"]
[null,"Risaralda",{"$f":"VLOOKUP(CONCATENATE(B39,$C$12,estrato_sel),estrato!A:F,6,0)","v":4846.5},{"$f":"IFERROR(VLOOKUP(CONCATENATE(B39,$C$12,indicador_sel),salud!A:H,6,0),0)","v":50},{"$f":"VLOOKUP(CONCATENATE(B39,$C$12,indicador_sel),salud!A:H,7,0)","v":85948},{"$f":"VLOOKUP(CONCATENATE(B39,$F$12,estrato_sel),estrato!A:F,6,0)","v":7033.333333333333},{"$f":"IFERROR(VLOOKUP(CONCATENATE(B39,$F$12,indicador_sel),salud!A:H,6,0),0)","v":33},{"$f":"VLOOKUP(CONCATENATE(B39,$F$12,indicador_sel),salud!A:H,7,0)","v":69087},"Risaralda"]
[null,"San Andrés y Providencia",{"$f":"VLOOKUP(CONCATENATE(B40,$C$12,estrato_sel),estrato!A:F,6,0)","v":480.16666666666669},{"$f":"IFERROR(VLOOKUP(CONCATENATE(B40,$C$12,indicador_sel),salud!A:H,6,0),0)","v":6},{"$f":"VLOOKUP(CONCATENATE(B40,$C$12,indicador_sel),salud!A:H,7,0)","v":5928},{"$f":"VLOOKUP(CONCATENATE(B40,$F$12,estrato_sel),estrato!A:F,6,0)","v":703.66666666666663},{"$f":"IFERROR(VLOOKUP(CONCATENATE(B40,$F$12,indicador_sel),salud!A:H,6,0),0)","v":2},{"$f":"VLOOKUP(CONCATENATE(B40,$F$12,indicador_sel),salud!A:H,7,0)","v":5095},"San Andrés y Providencia"]
{"$rows_left_out":180}
{"sheet":"dropdown","index":1,"n_rows":14,"n_cols":6,"rows_kept":14,"cut":false,"hidden":false,"merged":[]}
["salud","p1","p2","estrato","sentido","periodo"]
["Accidente de Transito Terrestre","2000-2005","2010-2015","IDH","Positivo",2005]
["Homicidio","2000-2005","2010-2015","IPM","Negativo",2015]
["Mortalidad Materna","2000-2005","2010-2015","PIB","Positivo","2000-2005"]
["Suicidio","2000-2005","2010-2015","PIBpc","Positivo","2010-2015"]
["Tasa de Fecundidad","2000-2005","2010-2015","Ruralidad","Negativo"]
["Tasa de mortalidad <1","2005-2010","2011-2015","IRCA","Negativo"]
["Tasa de mortalidad IRA <5","2005-2010","2011-2015","PIB-Percápita","Positivo"]
["Tasa de mortalidad DNT <5","2005-2010","2011-2015","Embarazadas >4 CPN ","Positivo"]
["BPN","2005-2010","2011-2015"]
["Mortalidad EDA<5 años","2005-2010","2011-2015"]
["Tasa de mortalidad en niñez","2005-2010","2011-2015"]
["Tasa de Mortalidad Neonatal","2005-2010","2011-2015"]
["Nacimientos por cesarea","2005-2010","2011-2015"]

{"sheet":"estrato","index":2,"n_rows":529,"n_cols":6,"rows_kept":529,"cut":false,"hidden":false,"merged":[]}
["D&P&I","depto","per","periodo","indicador","valor"]
[{"$f":"CONCATENATE(B2,C2,E2)","v":"Antioquiap1IPM"},"Antioquia","p1","2000-2005","IPM",0.44290000000000002]
[{"$f":"CONCATENATE(B3,C3,E3)","v":"Antioquiap2IPM"},"Antioquia","p2","2010-2015","IPM",0.44769999999999999]
["Atlánticop1IPM","Atlántico","p1","2000-2005","IPM",0.47327494547668858]
["Atlánticop2IPM","Atlántico","p2","2010-2015","IPM",0.47310000000000002]
["Bogotáp1IPM","Bogotá","p1","2000-2005","IPM",0.24301880000000001]
["Bogotáp2IPM","Bogotá","p2","2010-2015","IPM",0.24301880000000001]
["Bolívarp1IPM","Bolívar","p1","2000-2005","IPM",0.62841176903378515]
["Bolívarp2IPM","Bolívar","p2","2010-2015","IPM",0.63419999999999999]
["Boyacáp1IPM","Boyacá","p1","2000-2005","IPM",0.54870335066970766]
["Boyacáp2IPM","Boyacá","p2","2010-2015","IPM",0.55049999999999999]
["Caldasp1IPM","Caldas","p1","2000-2005","IPM",0.46099054479897722]
["Caldasp2IPM","Caldas","p2","2010-2015","IPM",0.46700000000000003]
["Caquetáp1IPM","Caquetá","p1","2000-2005","IPM",0.70836890156502963]
["Caquetáp2IPM","Caquetá","p2","2010-2015","IPM",0.72450000000000003]
["Caucap1IPM","Cauca","p1","2000-2005","IPM",0.70592293935975903]
["Caucap2IPM","Cauca","p2","2010-2015","IPM",0.71709999999999996]
["Cesarp1IPM","Cesar","p1","2000-2005","IPM",0.66713615450704578]
["Cesarp2IPM","Cesar","p2","2010-2015","IPM",0.6673]
["Chocóp1IPM","Chocó","p1","2000-2005","IPM",0.85794536539740618]
["Chocóp2IPM","Chocó","p2","2010-2015","IPM",0.86879999999999991]
["Córdobap1IPM","Córdoba","p1","2000-2005","IPM",0.79637061439388013]
["Córdobap2IPM","Córdoba","p2","2010-2015","IPM",0.79637061439388013]
["Cundinamarcap1IPM","Cundinamarca","p1","2000-2005","IPM",0.4138]
["Cundinamarcap2IPM","Cundinamarca","p2","2010-2015","IPM",0.41560000000000002]
["Huilap1IPM","Huila","p1","2000-2005","IPM",0.5802606249729837]
["Huilap2IPM","Huila","p2","2010-2015","IPM",0.58099999999999996]
["La Guajirap1IPM","La Guajira","p1","2000-2005","IPM",0.79718688058901011]
["La Guajirap2IPM","La Guajira","p2","2010-2015","IPM",0.79799999999999993]
["Magdalenap1IPM","Magdalena","p1","2000-2005","IPM",0.69675868594032397]
["Magdalenap2IPM","Magdalena","p2","2010-2015","IPM",0.69779999999999998]
["Metap1IPM","Meta","p1","2000-2005","IPM",0.5106249063590379]
["Metap2IPM","Meta","p2","2010-2015","IPM",0.54]
["Nariñop1IPM","Nariño","p1","2000-2005","IPM",0.68656142600008341]
["Nariñop2IPM","Nariño","p2","2010-2015","IPM",0.68889999999999996]
["Norte de Santanderp1IPM","Norte de Santander","p1","2000-2005","IPM",0.58204847524829029]
["Norte de Santanderp2IPM","Norte de Santander","p2","2010-2015","IPM",0.58810000000000007]
["Quindíop1IPM","Quindío","p1","2000-2005","IPM",0.41605245943696617]
["Quindíop2IPM","Quindío","p2","2010-2015","IPM",0.41639999999999999]
["Risaraldap1IPM","Risaralda","p1","2000-2005","IPM",0.41195451076014095]
{"$rows_left_out":490}
{"sheet":"salud","index":3,"n_rows":861,"n_cols":9,"rows_kept":861,"cut":false,"hidden":false,"merged":[]}
["D&P&I","depto","indicador","per","periodo","casos","denominador","expansor"]
[{"$f":"CONCATENATE(B2,D2,C2)","v":"Amazonasp1Mortalidad Materna"},"Amazonas","Mortalidad Materna","p1","2000-2005",12,8100,100000]
[{"$f":"CONCATENATE(B3,D3,C3)","v":"Amazonasp2Mortalidad Materna"},"Amazonas","Mortalidad Materna","p2","2010-2015",7,8618,100000]
["Antioquiap1Mortalidad Materna","Antioquia","Mortalidad Materna","p1","2000-2005",373,579644,100000]
["Antioquiap2Mortalidad Materna","Antioquia","Mortalidad Materna","p2","2010-2015",211,458869,100000]
["Araucap1Mortalidad Materna","Arauca","Mortalidad Materna","p1","2000-2005",30,31182,100000]
["Araucap2Mortalidad Materna","Arauca","Mortalidad Materna","p2","2010-2015",14,25633,100000]
["Atlánticop1Mortalidad Materna","Atlántico","Mortalidad Materna","p1","2000-2005",189,247615,100000]
["Atlánticop2Mortalidad Materna","Atlántico","Mortalidad Materna","p2","2010-2015",139,230819,100000]
["Bogotáp1Mortalidad Materna","Bogotá","Mortalidad Materna","p1","2000-2005",483,697517,100000]
["Bogotáp2Mortalidad Materna","Bogotá","Mortalidad Materna","p2","2010-2015",227,633311,100000]
["Bolívarp1Mortalidad Materna","Bolívar","Mortalidad Materna","p1","2000-2005",158,185444,100000]
["Bolívarp2Mortalidad Materna","Bolívar","Mortalidad Materna","p2","2010-2015",122,210859,100000]
["Boyacáp1Mortalidad Materna","Boyacá","Mortalidad Materna","p1","2000-2005",114,129450,100000]
["Boyacáp2Mortalidad Materna","Boyacá","Mortalidad Materna","p2","2010-2015",51,99677,100000]
["Caldasp1Mortalidad Materna","Caldas","Mortalidad Materna","p1","2000-2005",80,91186,100000]
["Caldasp2Mortalidad Materna","Caldas","Mortalidad Materna","p2","2010-2015",33,62084,100000]
["Caquetáp1Mortalidad Materna","Caquetá","Mortalidad Materna","p1","2000-2005",73,41197,100000]
["Caquetáp2Mortalidad Materna","Caquetá","Mortalidad Materna","p2","2010-2015",53,45108,100000]
["Casanarep1Mortalidad Materna","Casanare","Mortalidad Materna","p1","2000-2005",16,34515,100000]
["Casanarep2Mortalidad Materna","Casanare","Mortalidad Materna","p2","2010-2015",19,41269,100000]
["Caucap1Mortalidad Materna","Cauca","Mortalidad Materna","p1","2000-2005",162,107200,100000]
["Caucap2Mortalidad Materna","Cauca","Mortalidad Materna","p2","2010-2015",113,106211,100000]
["Cesarp1Mortalidad Materna","Cesar","Mortalidad Materna","p1","2000-2005",89,115867,100000]
["Cesarp2Mortalidad Materna","Cesar","Mortalidad Materna","p2","2010-2015",102,123632,100000]
["Chocóp1Mortalidad Materna","Chocó","Mortalidad Materna","p1","2000-2005",95,28046,100000]
["Chocóp2Mortalidad Materna","Chocó","Mortalidad Materna","p2","2010-2015",78,38543,100000]
["Córdobap1Mortalidad Materna","Córdoba","Mortalidad Materna","p1","2000-2005",146,146885,100000]
["Córdobap2Mortalidad Materna","Córdoba","Mortalidad Materna","p2","2010-2015",161,159118,100000]
["Cundinamarcap1Mortalidad Materna","Cundinamarca","Mortalidad Materna","p1","2000-2005",167,213177,100000]
["Cundinamarcap2Mortalidad Materna","Cundinamarca","Mortalidad Materna","p2","2010-2015",103,207543,100000]
["Guainíap1Mortalidad Materna","Guainía","Mortalidad Materna","p1","2000-2005",8,3252,100000]
["Guainíap2Mortalidad Materna","Guainía","Mortalidad Materna","p2","2010-2015",6,3520,100000]
["Guaviarep1Mortalidad Materna","Guaviare","Mortalidad Materna","p1","2000-2005",22,9674,100000]
["Guaviarep2Mortalidad Materna","Guaviare","Mortalidad Materna","p2","2010-2015",7,7240,100000]
["Huilap1Mortalidad Materna","Huila","Mortalidad Materna","p1","2000-2005",93,129970,100000]
["Huilap2Mortalidad Materna","Huila","Mortalidad Materna","p2","2010-2015",42,120104,100000]
["La Guajirap1Mortalidad Materna","La Guajira","Mortalidad Materna","p1","2000-2005",73,62074,100000]
["La Guajirap2Mortalidad Materna","La Guajira","Mortalidad Materna","p2","2010-2015",136,81311,100000]
["Magdalenap1Mortalidad Materna","Magdalena","Mortalidad Materna","p1","2000-2005",134,117816,100000]
{"$rows_left_out":822}
{"sheet":"recoding","index":4,"n_rows":6,"n_cols":3,"rows_kept":6,"cut":false,"hidden":false,"merged":[]}
["indicador","año","periodo"]
["IDH",2005,"2000-2005"]
["IPM",2005,"2000-2005"]
["IDH",2015,"2010-2015"]
["IPM",2013,"2010-2015"]
["IRCA"]